Reaction Details
TargetGastrin-releasing peptide receptor
LigandBDBM50112622
Substrate/Competitorn/a
Meas. Tech.ChEMBL_39620 (CHEMBL649928)
IC50 410±n/a nM
Citation Achilefu, SJimenez, HNDorshow, RBBugaj, JEWebb, EGWilhelm, RRRajagopalan, RJohler, JErion, JL Synthesis, in vitro receptor binding, and in vivo evaluation of fluorescein and carbocyanine peptide-based optical contrast agents. J Med Chem45:2003-15 (2002) Gastrin-releasing peptide receptor
Name:Gastrin-releasing peptide receptor
Type:Enzyme Catalytic Domain
Mol. Mass.:43227.55
Organism:RAT
Description:Gastrin-Releasing peptide 0 RAT::P52500
Residue:384
BDBM50112622
NameBDBM50112622
Synonyms:(alpha-DTPA-K-Q-W-A-V-G-H-L-M-NH2) | CHEMBL440609
TypeSmall organic molecule
Emp. Form.C63H98N18O19S
Mol. Mass.1443.626
SMILESCSCCC(NC(=O)C(CC(C)C)NC(=O)C(Cc1cnc[nH]1)NC(=O)CNC(=O)C(NC(=O)C(C)NC(=O)C(Cc1c[nH]c2ccccc12)NC(=O)C(CCC(N)=O)NC(=O)C(CCCCN)NC(=O)CN(CCN(CCN(CC(O)=O)CC(O)=O)CC(O)=O)CC(O)=O)C(C)C)C(N)=O