Reaction Details
TargetGastrin-releasing peptide receptor
LigandBDBM50112627
Substrate/Competitorn/a
Meas. Tech.ChEMBL_39620 (CHEMBL649928)
IC50 15±n/a nM
Citation Achilefu, SJimenez, HNDorshow, RBBugaj, JEWebb, EGWilhelm, RRRajagopalan, RJohler, JErion, JL Synthesis, in vitro receptor binding, and in vivo evaluation of fluorescein and carbocyanine peptide-based optical contrast agents. J Med Chem45:2003-15 (2002) Gastrin-releasing peptide receptor
Name:Gastrin-releasing peptide receptor
Type:Enzyme Catalytic Domain
Mol. Mass.:43227.55
Organism:RAT
Description:Gastrin-Releasing peptide 0 RAT::P52500
Residue:384
BDBM50112627
NameBDBM50112627
Synonyms:(alpha-FITC-epsilon-DOTA-K-Q-W-A-V-G-H-L-M-NH2) | CHEMBL385735
TypeSmall organic molecule
Emp. Form.C86H114N20O22S2
Mol. Mass.1844.076
SMILESCSCCC(NC(=O)C(CC(C)C)NC(=O)C(Cc1cnc[nH]1)NC(=O)CNC(=O)C(NC(=O)C(C)NC(=O)C(Cc1c[nH]c2ccccc12)NC(=O)C(CCC(N)=O)NC(=O)C(CCCCNC(=O)CN1CCN(CC(O)=O)CCN(CC(O)=O)CCN(CC(O)=O)CC1)NC(=S)Nc1ccc2c(c1)C(=O)OC21c2ccc(O)cc2Oc2cc(O)ccc12)C(C)C)C(N)=O