Reaction Details
TargetGastrin-releasing peptide receptor
LigandBDBM50112639
Substrate/Competitorn/a
Meas. Tech.ChEMBL_39620 (CHEMBL649928)
IC50 1.1±n/a nM
Citation Achilefu, SJimenez, HNDorshow, RBBugaj, JEWebb, EGWilhelm, RRRajagopalan, RJohler, JErion, JL Synthesis, in vitro receptor binding, and in vivo evaluation of fluorescein and carbocyanine peptide-based optical contrast agents. J Med Chem45:2003-15 (2002) Gastrin-releasing peptide receptor
Name:Gastrin-releasing peptide receptor
Type:Enzyme Catalytic Domain
Mol. Mass.:43227.55
Organism:RAT
Description:Gastrin-Releasing peptide 0 RAT::P52500
Residue:384
BDBM50112639
NameBDBM50112639
Synonyms:CHEMBL402688 | pQ-Q-R-Y-G-N-Q-W-A-V-G-H-L-M-NH2
TypeSmall organic molecule
Emp. Form.C74H108N24O19S
Mol. Mass.1669.864
SMILESCSCCC(NC(=O)C(CC(C)C)NC(=O)C(Cc1cnc[nH]1)NC(=O)CNC(=O)C(NC(=O)C(C)NC(=O)C(Cc1c[nH]c2ccccc12)NC(=O)C(CCC(N)=O)NC(=O)C(CC(N)=O)NC(=O)CNC(=O)C(Cc1ccc(O)cc1)NC(=O)C(CCCNC(N)=N)NC(=O)C(CCC(N)=O)NC(=O)C1CCC(=O)N1)C(C)C)C(N)=O