Reaction Details
TargetGastrin-releasing peptide receptor
LigandBDBM50112646
Substrate/Competitorn/a
Meas. Tech.ChEMBL_39620 (CHEMBL649928)
IC50 15.6±n/a nM
Citation Achilefu, SJimenez, HNDorshow, RBBugaj, JEWebb, EGWilhelm, RRRajagopalan, RJohler, JErion, JL Synthesis, in vitro receptor binding, and in vivo evaluation of fluorescein and carbocyanine peptide-based optical contrast agents. J Med Chem45:2003-15 (2002) Gastrin-releasing peptide receptor
Name:Gastrin-releasing peptide receptor
Type:Enzyme Catalytic Domain
Mol. Mass.:43227.55
Organism:RAT
Description:Gastrin-Releasing peptide 0 RAT::P52500
Residue:384
BDBM50112646
NameBDBM50112646
Synonyms:(alpha-FITC-K-G-S-G-Q-W-A-V-G-H-L-M-NH2) | CHEMBL412447
TypeSmall organic molecule
Emp. Form.C77H99N19O19S2
Mol. Mass.1658.856
SMILESCSCCC(NC(=O)C(CC(C)C)NC(=O)C(Cc1cnc[nH]1)NC(=O)CNC(=O)C(NC(=O)C(C)NC(=O)C(Cc1c[nH]c2ccccc12)NC(=O)C(CCC(N)=O)NC(=O)CNC(=O)C(CO)NC(=O)CNC(=O)C(CCCCN)NC(=S)Nc1ccc2c(c1)C(=O)OC21c2ccc(O)cc2Oc2cc(O)ccc12)C(C)C)C(N)=O