Reaction Details
TargetAmine oxidase [flavin-containing] A
LigandBDBM29136
Substrate/Competitorn/a
Meas. Tech.ChEMBL_2045004 (CHEMBL4699703)
IC50 5890±n/a nM
Citation Wang, XBYin, FCHuang, MJiang, NLan, JSKong, LY Chromone and donepezil hybrids as new multipotent cholinesterase and monoamine oxidase inhibitors for the potential treatment of Alzheimer's disease. RSC Med Chem11:225-233 (2020) 
 
Amine oxidase [flavin-containing] A
Name:Amine oxidase [flavin-containing] A
Type:Protein
Mol. Mass.:59689.53
Organism:Homo sapiens (Human)
Description:P21397
Residue:527
BDBM29136
NameBDBM29136
Synonyms:CHEMBL92401 Iprazid | Iproniazid
TypeSmall organic molecule
Emp. Form.C9H13N3O
Mol. Mass.179.219
SMILESCC(C)NNC(=O)c1ccncc1