Reaction Details
TargetThromboxane-A synthase
LigandBDBM50017896
Substrate/Competitorn/a
Meas. Tech.ChEBML_209947
IC50 24±n/a nM
Citation Fujita, MSeki, T Syntheses and bioactivities of novel carbamates combining platelet activating factor (PAF) receptor antagonist with thromboxane synthase inhibitor (TxSI). Bioorg Med Chem Lett12:1383-6 (2002) Thromboxane-A synthase
Name:Thromboxane-A synthase
Type:Enzyme
Mol. Mass.:60524.67
Organism:Homo sapiens (Human)
Description:P24557
Residue:533
BDBM50017896
NameBDBM50017896
Synonyms:(E)-3-(4-Imidazol-1-ylmethyl-phenyl)-acrylic acid CHEMBL11662 Ozagrel | cid_5282440
TypeSmall organic molecule
Emp. Form.C13H12N2O2
Mol. Mass.228.2466
SMILESOC(=O)\C=C\c1ccc(Cn2ccnc2)cc1