Reaction Details
TargetDipeptidyl peptidase 4
LigandBDBM50113678
Substrate/Competitorn/a
Meas. Tech.ChEMBL_53353 (CHEMBL664523)
IC50 17±n/a nM
Citation Villhauer, EBBrinkman, JANaderi, GBDunning, BEMangold, BLMone, MDRussell, MEWeldon, SCHughes, TE 1-[2-[(5-Cyanopyridin-2-yl)amino]ethylamino]acetyl-2-(S)-pyrrolidinecarbonitrile: a potent, selective, and orally bioavailable dipeptidyl peptidase IV inhibitor with antihyperglycemic properties. J Med Chem45:2362-5 (2002) Dipeptidyl peptidase 4
Name:Dipeptidyl peptidase 4
Type:Enzyme
Mol. Mass.:88084.94
Organism:Rattus norvegicus (rat)
Description:n/a
Residue:767
BDBM50113678
NameBDBM50113678
Synonyms:1-{2-[2-(5-Nitro-pyridin-2-ylamino)-ethylamino]-acetyl}-pyrrolidine-2-carbonitrile | CHEMBL77539
TypeSmall organic molecule
Emp. Form.C14H18N6O3
Mol. Mass.318.3311
SMILES[O-][N+](=O)c1ccc(NCCNCC(=O)N2CCC[C@H]2C#N)nc1