Reaction Details
TargetDipeptidyl peptidase 4
LigandBDBM11694
Substrate/Competitorn/a
Meas. Tech.ChEMBL_53209 (CHEMBL664030)
IC50 2±n/a nM
Citation Villhauer, EBBrinkman, JANaderi, GBDunning, BEMangold, BLMone, MDRussell, MEWeldon, SCHughes, TE 1-[2-[(5-Cyanopyridin-2-yl)amino]ethylamino]acetyl-2-(S)-pyrrolidinecarbonitrile: a potent, selective, and orally bioavailable dipeptidyl peptidase IV inhibitor with antihyperglycemic properties. J Med Chem45:2362-5 (2002) Dipeptidyl peptidase 4
Name:Dipeptidyl peptidase 4
Type:Enzyme
Mol. Mass.:88271.01
Organism:Homo sapiens (Human)
Description:P27487
Residue:766
BDBM11694
NameBDBM11694
Synonyms:(2S)-1-[(2S)-2-amino-2-cyclohexylacetyl]pyrrolidine-2-carbonitrile CHEMBL307636 Cyclohexylglycine-(2S)-cyanopyrrolidine 2
TypeSmall organic molecule
Emp. Form.C13H21N3O
Mol. Mass.235.3253
SMILESN[C@@H](C1CCCCC1)C(=O)N1CCC[C@H]1C#N