Reaction Details
TargetDipeptidyl peptidase 4
LigandBDBM11113
Substrate/Competitorn/a
Meas. Tech.ChEMBL_53210 (CHEMBL664031)
IC50 22±n/a nM
Citation Villhauer, EBBrinkman, JANaderi, GBDunning, BEMangold, BLMone, MDRussell, MEWeldon, SCHughes, TE 1-[2-[(5-Cyanopyridin-2-yl)amino]ethylamino]acetyl-2-(S)-pyrrolidinecarbonitrile: a potent, selective, and orally bioavailable dipeptidyl peptidase IV inhibitor with antihyperglycemic properties. J Med Chem45:2362-5 (2002) Dipeptidyl peptidase 4
Name:Dipeptidyl peptidase 4
Type:Enzyme
Mol. Mass.:88271.01
Organism:Homo sapiens (Human)
Description:P27487
Residue:766
BDBM11113
NameBDBM11113
Synonyms:6-{[2-({2-[(2S)-2-cyanopyrrolidin-1-yl]-2-oxoethyl}amino)ethyl]amino}pyridine-3-carbonitrile CHEMBL77538 cyano-(S)-pyrrolidine deriv. 1 | cyanopyrrolidine derivative 2
TypeSmall organic molecule
Emp. Form.C15H18N6O
Mol. Mass.298.343
SMILESO=C(CNCCNc1ccc(cn1)C#N)N1CCC[C@H]1C#N