Reaction Details
TargetCyclin-dependent kinase 1
LigandBDBM50113683
Substrate/Competitorn/a
Meas. Tech.ChEMBL_50316 (CHEMBL661621)
IC50 2700000±n/a nM
Citation Naumann, TMatter, H Structural classification of protein kinases using 3D molecular interaction field analysis of their ligand binding sites: target family landscapes. J Med Chem45:2366-78 (2002) Cyclin-dependent kinase 1
Name:Cyclin-dependent kinase 1
Type:Enzyme Subunit
Mol. Mass.:34101.08
Organism:Homo sapiens (Human)
Description:P06493
Residue:297
BDBM50113683
NameBDBM50113683
Synonyms:2-[6-(2,4-Dichloro-phenylamino)-9-isopropyl-9H-purin-2-ylamino]-ethanol | CHEMBL75633
TypeSmall organic molecule
Emp. Form.C16H18Cl2N6O
Mol. Mass.381.26
SMILESCC(C)n1cnc2c(Nc3ccc(Cl)cc3Cl)nc(NCCO)nc12