Reaction Details
TargetCyclin-dependent kinase 1
LigandBDBM50113685
Substrate/Competitorn/a
Meas. Tech.ChEMBL_50316 (CHEMBL661621)
IC50 5000000±n/a nM
Citation Naumann, TMatter, H Structural classification of protein kinases using 3D molecular interaction field analysis of their ligand binding sites: target family landscapes. J Med Chem45:2366-78 (2002) Cyclin-dependent kinase 1
Name:Cyclin-dependent kinase 1
Type:Enzyme Subunit
Mol. Mass.:34101.08
Organism:Homo sapiens (Human)
Description:P06493
Residue:297
BDBM50113685
NameBDBM50113685
Synonyms:CHEMBL75809 | N*2*-Benzyl-N*2*-(2-dimethylamino-ethyl)-9-isopropyl-N*6*-(4-methoxy-benzyl)-9H-purine-2,6-diamine
TypeSmall organic molecule
Emp. Form.C27H35N7O
Mol. Mass.473.6131
SMILESCOc1ccc(CNc2nc(nc3n(cnc23)C(C)C)N(CCN(C)C)Cc2ccccc2)cc1