Reaction Details
TargetCyclin-dependent kinase 1
LigandBDBM50113691
Substrate/Competitorn/a
Meas. Tech.ChEMBL_50316 (CHEMBL661621)
IC50 800000±n/a nM
Citation Naumann, TMatter, H Structural classification of protein kinases using 3D molecular interaction field analysis of their ligand binding sites: target family landscapes. J Med Chem45:2366-78 (2002) Cyclin-dependent kinase 1
Name:Cyclin-dependent kinase 1
Type:Enzyme Subunit
Mol. Mass.:34101.08
Organism:Homo sapiens (Human)
Description:P06493
Residue:297
BDBM50113691
NameBDBM50113691
Synonyms:2-[6-(3-Chloro-phenylamino)-9-isopropyl-9H-purin-2-ylamino]-2-phenyl-ethanol | CHEMBL432356
TypeSmall organic molecule
Emp. Form.C22H23ClN6O
Mol. Mass.422.911
SMILESCC(C)n1cnc2c(Nc3cccc(Cl)c3)nc(N[C@H](CO)c3ccccc3)nc12