Reaction Details
TargetCyclin-dependent kinase 1
LigandBDBM50113693
Substrate/Competitorn/a
Meas. Tech.ChEMBL_50316 (CHEMBL661621)
IC50 52000000±n/a nM
Citation Naumann, TMatter, H Structural classification of protein kinases using 3D molecular interaction field analysis of their ligand binding sites: target family landscapes. J Med Chem45:2366-78 (2002) Cyclin-dependent kinase 1
Name:Cyclin-dependent kinase 1
Type:Enzyme Subunit
Mol. Mass.:34101.08
Organism:Homo sapiens (Human)
Description:P06493
Residue:297
BDBM50113693
NameBDBM50113693
Synonyms:2-[6-(3-Amino-4-chloro-phenylamino)-9-isopropyl-9H-purin-2-ylamino]-3-methyl-butan-1-ol | CHEMBL311354
TypeSmall organic molecule
Emp. Form.C19H26ClN7O
Mol. Mass.403.909
SMILESCC(C)[C@H](CO)Nc1nc(Nc2ccc(Cl)c(N)c2)c2ncn(C(C)C)c2n1