Reaction Details
TargetCyclin-dependent kinase 1
LigandBDBM50113713
Substrate/Competitorn/a
Meas. Tech.ChEMBL_50316 (CHEMBL661621)
IC50 1600000±n/a nM
Citation Naumann, TMatter, H Structural classification of protein kinases using 3D molecular interaction field analysis of their ligand binding sites: target family landscapes. J Med Chem45:2366-78 (2002) Cyclin-dependent kinase 1
Name:Cyclin-dependent kinase 1
Type:Enzyme Subunit
Mol. Mass.:34101.08
Organism:Homo sapiens (Human)
Description:P06493
Residue:297
BDBM50113713
NameBDBM50113713
Synonyms:1-Amino-3-[9-isopropyl-6-(4-methoxy-benzylamino)-9H-purin-2-ylamino]-propan-2-ol | CHEMBL419830
TypeSmall organic molecule
Emp. Form.C19H27N7O2
Mol. Mass.385.4634
SMILESCOc1ccc(CNc2nc(NCC(O)CN)nc3n(cnc23)C(C)C)cc1