Reaction Details
TargetCyclin-dependent kinase 1
LigandBDBM50113724
Substrate/Competitorn/a
Meas. Tech.ChEMBL_50316 (CHEMBL661621)
IC50 130000±n/a nM
Citation Naumann, TMatter, H Structural classification of protein kinases using 3D molecular interaction field analysis of their ligand binding sites: target family landscapes. J Med Chem45:2366-78 (2002) Cyclin-dependent kinase 1
Name:Cyclin-dependent kinase 1
Type:Enzyme Subunit
Mol. Mass.:34101.08
Organism:Homo sapiens (Human)
Description:P06493
Residue:297
BDBM50113724
NameBDBM50113724
Synonyms:2-[9-Isopropyl-6-(4-methoxy-benzylamino)-9H-purin-2-ylamino]-butan-1-ol | CHEMBL310590
TypeSmall organic molecule
Emp. Form.C20H28N6O2
Mol. Mass.384.4753
SMILESCC[C@H](CO)Nc1nc(NCc2ccc(OC)cc2)c2ncn(C(C)C)c2n1