Reaction Details
TargetCyclin-dependent kinase 1
LigandBDBM50113721
Substrate/Competitorn/a
Meas. Tech.ChEMBL_50316 (CHEMBL661621)
IC50 300000±n/a nM
Citation Naumann, TMatter, H Structural classification of protein kinases using 3D molecular interaction field analysis of their ligand binding sites: target family landscapes. J Med Chem45:2366-78 (2002) Cyclin-dependent kinase 1
Name:Cyclin-dependent kinase 1
Type:Enzyme Subunit
Mol. Mass.:34101.08
Organism:Homo sapiens (Human)
Description:P06493
Residue:297
BDBM50113721
NameBDBM50113721
Synonyms:1-[6-(3-Chloro-phenylamino)-9-isopropyl-9H-purin-2-ylamino]-indan-2-ol | CHEMBL79764
TypeSmall organic molecule
Emp. Form.C23H23ClN6O
Mol. Mass.434.921
SMILESCC(C)n1cnc2c(Nc3cccc(Cl)c3)nc(NC3[C@@H](O)Cc4ccccc34)nc12