Reaction Details
TargetCyclin-dependent kinase 1
LigandBDBM50113722
Substrate/Competitorn/a
Meas. Tech.ChEMBL_50316 (CHEMBL661621)
IC50 100000±n/a nM
Citation Naumann, TMatter, H Structural classification of protein kinases using 3D molecular interaction field analysis of their ligand binding sites: target family landscapes. J Med Chem45:2366-78 (2002) Cyclin-dependent kinase 1
Name:Cyclin-dependent kinase 1
Type:Enzyme Subunit
Mol. Mass.:34101.08
Organism:Homo sapiens (Human)
Description:P06493
Residue:297
BDBM50113722
NameBDBM50113722
Synonyms:2-[9-Isopropyl-6-(4-methoxy-benzylamino)-9H-purin-2-ylamino]-4-methyl-pentan-1-ol | CHEMBL77732
TypeSmall organic molecule
Emp. Form.C22H32N6O2
Mol. Mass.412.5285
SMILESCOc1ccc(CNc2nc(N[C@@H](CO)CC(C)C)nc3n(cnc23)C(C)C)cc1