Reaction Details
TargetMitogen-activated protein kinase 1
LigandBDBM50113679
Substrate/Competitorn/a
Meas. Tech.ChEMBL_124151 (CHEMBL737113)
IC50 50000±n/a nM
Citation Naumann, TMatter, H Structural classification of protein kinases using 3D molecular interaction field analysis of their ligand binding sites: target family landscapes. J Med Chem45:2366-78 (2002) Mitogen-activated protein kinase 1
Name:Mitogen-activated protein kinase 1
Type:Ser/Thr Protein Kinase
Mol. Mass.:41392.76
Organism:Homo sapiens (Human)
Description:P28482
Residue:360
BDBM50113679
NameBDBM50113679
Synonyms:9-Isopropyl-N*6*-(3-methyl-but-2-enyl)-9H-purine-2,6-diamine | CHEMBL77155
TypeSmall organic molecule
Emp. Form.C13H20N6
Mol. Mass.260.3381
SMILES[#6]-[#6](-[#6])-n1cnc2c(-[#7]-[#6]\[#6]=[#6](/[#6])-[#6])nc(-[#7])nc12