Reaction Details
TargetCyclin-dependent kinase 1
LigandBDBM50113736
Substrate/Competitorn/a
Meas. Tech.ChEMBL_50316 (CHEMBL661621)
IC50 560000±n/a nM
Citation Naumann, TMatter, H Structural classification of protein kinases using 3D molecular interaction field analysis of their ligand binding sites: target family landscapes. J Med Chem45:2366-78 (2002) Cyclin-dependent kinase 1
Name:Cyclin-dependent kinase 1
Type:Enzyme Subunit
Mol. Mass.:34101.08
Organism:Homo sapiens (Human)
Description:P06493
Residue:297
BDBM50113736
NameBDBM50113736
Synonyms:2-[9-Isopropyl-6-(4-methoxy-benzylamino)-9H-purin-2-ylamino]-propane-1,3-diol | CHEMBL75795
TypeSmall organic molecule
Emp. Form.C19H26N6O3
Mol. Mass.386.4481
SMILESCOc1ccc(CNc2nc(NC(CO)CO)nc3n(cnc23)C(C)C)cc1