Reaction Details
TargetCyclin-dependent kinase 1
LigandBDBM50113744
Substrate/Competitorn/a
Meas. Tech.ChEMBL_50316 (CHEMBL661621)
IC50 1400000±n/a nM
Citation Naumann, TMatter, H Structural classification of protein kinases using 3D molecular interaction field analysis of their ligand binding sites: target family landscapes. J Med Chem45:2366-78 (2002) Cyclin-dependent kinase 1
Name:Cyclin-dependent kinase 1
Type:Enzyme Subunit
Mol. Mass.:34101.08
Organism:Homo sapiens (Human)
Description:P06493
Residue:297
BDBM50113744
NameBDBM50113744
Synonyms:2-{1-[6-(3-Chloro-phenylamino)-9-isopropyl-9H-purin-2-yl]-piperidin-2-yl}-ethanol | CHEMBL80693
TypeSmall organic molecule
Emp. Form.C21H27ClN6O
Mol. Mass.414.932
SMILESCC(C)n1cnc2c(Nc3cccc(Cl)c3)nc(nc12)N1CCCCC1CCO