Reaction Details
TargetMacrophage migration inhibitory factor
LigandBDBM50553872
Substrate/Competitorn/a
Meas. Tech.ChEMBL_2047508 (CHEMBL4702207)
Kd 156±n/a nM
Citation Xiao, ZChen, DSong, Svan der Vlag, Rvan der Wouden, PEvan Merkerk, RCool, RHHirsch, AKHMelgert, BNQuax, WJPoelarends, GJDekker, FJ 7-Hydroxycoumarins Are Affinity-Based Fluorescent Probes for Competitive Binding Studies of Macrophage Migration Inhibitory Factor. J Med Chem63:11920-11933 (2020) 
 
Macrophage migration inhibitory factor
Name:Macrophage migration inhibitory factor
Type:Enzyme
Mol. Mass.:12478.18
Organism:Homo sapiens (Human)
Description:P14174
Residue:115
BDBM50553872
NameBDBM50553872
Synonyms:CHEMBL4794376
TypeSmall organic molecule
Emp. Form.C16H15NO5
Mol. Mass.301.294
SMILESCOc1ccc(cc1OC)N1Cc2ccc(O)cc2OC1=O