Reaction Details
TargetMacrophage migration inhibitory factor
LigandBDBM50553887
Substrate/Competitorn/a
Meas. Tech.ChEMBL_2047515 (CHEMBL4702214)
Kd 16±n/a nM
Citation Xiao, ZChen, DSong, Svan der Vlag, Rvan der Wouden, PEvan Merkerk, RCool, RHHirsch, AKHMelgert, BNQuax, WJPoelarends, GJDekker, FJ 7-Hydroxycoumarins Are Affinity-Based Fluorescent Probes for Competitive Binding Studies of Macrophage Migration Inhibitory Factor. J Med Chem63:11920-11933 (2020) 
 
Macrophage migration inhibitory factor
Name:Macrophage migration inhibitory factor
Type:Enzyme
Mol. Mass.:12478.18
Organism:Homo sapiens (Human)
Description:P14174
Residue:115
BDBM50553887
NameBDBM50553887
Synonyms:CHEMBL4779696
TypeSmall organic molecule
Emp. Form.C22H14O5
Mol. Mass.358.3436
SMILESOC(=O)c1ccc(cc1)-c1ccc(cc1)-c1cc2ccc(O)cc2oc1=O