Reaction Details
TargetMacrophage migration inhibitory factor
LigandBDBM50186426
Substrate/Competitorn/a
Meas. Tech.ChEMBL_2047522 (CHEMBL4702221)
Kd 47000±n/a nM
Citation Xiao, ZChen, DSong, Svan der Vlag, Rvan der Wouden, PEvan Merkerk, RCool, RHHirsch, AKHMelgert, BNQuax, WJPoelarends, GJDekker, FJ 7-Hydroxycoumarins Are Affinity-Based Fluorescent Probes for Competitive Binding Studies of Macrophage Migration Inhibitory Factor. J Med Chem63:11920-11933 (2020) 
 
Macrophage migration inhibitory factor
Name:Macrophage migration inhibitory factor
Type:Enzyme
Mol. Mass.:12478.18
Organism:Homo sapiens (Human)
Description:P14174
Residue:115
BDBM50186426
NameBDBM50186426
Synonyms:CHEMBL210858 US10968198, ISO-1 methyl 2-(3-(4-hydroxyphenyl)-4,5-dihydroisoxazol-5-yl)acetate
TypeSmall organic molecule
Emp. Form.C12H13NO4
Mol. Mass.235.2359
SMILESCOC(=O)CC1CC(=NO1)c1ccc(O)cc1