Reaction Details
TargetMacrophage migration inhibitory factor
LigandBDBM50553882
Substrate/Competitorn/a
Meas. Tech.ChEMBL_2047522 (CHEMBL4702221)
Kd 4000±n/a nM
Citation Xiao, ZChen, DSong, Svan der Vlag, Rvan der Wouden, PEvan Merkerk, RCool, RHHirsch, AKHMelgert, BNQuax, WJPoelarends, GJDekker, FJ 7-Hydroxycoumarins Are Affinity-Based Fluorescent Probes for Competitive Binding Studies of Macrophage Migration Inhibitory Factor. J Med Chem63:11920-11933 (2020) 
 
Macrophage migration inhibitory factor
Name:Macrophage migration inhibitory factor
Type:Enzyme
Mol. Mass.:12478.18
Organism:Homo sapiens (Human)
Description:P14174
Residue:115
BDBM50553882
NameBDBM50553882
Synonyms:CHEMBL4751935
TypeSmall organic molecule
Emp. Form.C13H10N4O
Mol. Mass.238.2447
SMILESOc1ccc(cc1)-n1cc(nn1)-c1ccccn1