Reaction Details
TargetMacrophage migration inhibitory factor
LigandBDBM50553884
Substrate/Competitorn/a
Meas. Tech.ChEMBL_2047522 (CHEMBL4702221)
Kd 5600±n/a nM
Citation Xiao, ZChen, DSong, Svan der Vlag, Rvan der Wouden, PEvan Merkerk, RCool, RHHirsch, AKHMelgert, BNQuax, WJPoelarends, GJDekker, FJ 7-Hydroxycoumarins Are Affinity-Based Fluorescent Probes for Competitive Binding Studies of Macrophage Migration Inhibitory Factor. J Med Chem63:11920-11933 (2020) 
 
Macrophage migration inhibitory factor
Name:Macrophage migration inhibitory factor
Type:Enzyme
Mol. Mass.:12478.18
Organism:Homo sapiens (Human)
Description:P14174
Residue:115
BDBM50553884
NameBDBM50553884
Synonyms:CHEMBL4787577
TypeSmall organic molecule
Emp. Form.C15H13FN2O3
Mol. Mass.288.2737
SMILESCOc1ccc(cc1)C(=O)N\N=C\c1ccc(O)c(F)c1