Reaction Details
TargetMacrophage migration inhibitory factor
LigandBDBM50553885
Substrate/Competitorn/a
Meas. Tech.ChEMBL_2047522 (CHEMBL4702221)
Kd 4400±n/a nM
Citation Xiao, ZChen, DSong, Svan der Vlag, Rvan der Wouden, PEvan Merkerk, RCool, RHHirsch, AKHMelgert, BNQuax, WJPoelarends, GJDekker, FJ 7-Hydroxycoumarins Are Affinity-Based Fluorescent Probes for Competitive Binding Studies of Macrophage Migration Inhibitory Factor. J Med Chem63:11920-11933 (2020) 
 
Macrophage migration inhibitory factor
Name:Macrophage migration inhibitory factor
Type:Enzyme
Mol. Mass.:12478.18
Organism:Homo sapiens (Human)
Description:P14174
Residue:115
BDBM50553885
NameBDBM50553885
Synonyms:CHEMBL4745151
TypeSmall organic molecule
Emp. Form.C18H14FN5O2
Mol. Mass.351.3345
SMILESOc1ccc(cc1F)-n1cc(CNC(=O)c2cc3ccccc3[nH]2)nn1