Reaction Details
TargetCoagulation factor X
LigandBDBM50114466
Substrate/Competitorn/a
Meas. Tech.ChEBML_48983
IC50 2.5±n/a nM
Citation Zhang, PZuckett, JFWoolfrey, JTran, KHuang, BWong, PSinha, UPark, GReed, AMalinowski, JHollenbach, SScarborough, RMZhu, BY Design, synthesis, and SAR of monobenzamidines and aminoisoquinolines as factor Xa inhibitors. Bioorg Med Chem Lett12:1657-61 (2002) Coagulation factor X
Name:Coagulation factor X
Type:Enzyme
Mol. Mass.:54726.60
Organism:Homo sapiens (Human)
Description:n/a
Residue:488
BDBM50114466
NameBDBM50114466
Synonyms:4-(3-Carbamimidoyl-phenoxy)-3-[(2'-sulfamoyl-biphenyl-4-carbonyl)-amino]-benzoic acid methyl ester | CHEMBL47939
TypeSmall organic molecule
Emp. Form.C28H24N4O6S
Mol. Mass.544.578
SMILESCOC(=O)c1ccc(Oc2cccc(c2)C(N)=N)c(NC(=O)c2ccc(cc2)-c2ccccc2S(N)(=O)=O)c1