Reaction Details
TargetCoagulation factor X
LigandBDBM50114477
Substrate/Competitorn/a
Meas. Tech.ChEBML_48983
IC50 1.6±n/a nM
Citation Zhang, PZuckett, JFWoolfrey, JTran, KHuang, BWong, PSinha, UPark, GReed, AMalinowski, JHollenbach, SScarborough, RMZhu, BY Design, synthesis, and SAR of monobenzamidines and aminoisoquinolines as factor Xa inhibitors. Bioorg Med Chem Lett12:1657-61 (2002) Coagulation factor X
Name:Coagulation factor X
Type:Enzyme
Mol. Mass.:54726.60
Organism:Homo sapiens (Human)
Description:n/a
Residue:488
BDBM50114477
NameBDBM50114477
Synonyms:2'-Sulfamoyl-biphenyl-4-carboxylic acid [5-bromo-2-(3-carbamimidoyl-phenoxy)-phenyl]-amide | CHEMBL45374
TypeSmall organic molecule
Emp. Form.C26H21BrN4O4S
Mol. Mass.565.438
SMILESNC(=N)c1cccc(Oc2ccc(Br)cc2NC(=O)c2ccc(cc2)-c2ccccc2S(N)(=O)=O)c1