Reaction Details
TargetProthrombin
LigandBDBM50114479
Substrate/Competitorn/a
Meas. Tech.ChEBML_208879
IC50>11000±n/a nM
Citation Zhang, PZuckett, JFWoolfrey, JTran, KHuang, BWong, PSinha, UPark, GReed, AMalinowski, JHollenbach, SScarborough, RMZhu, BY Design, synthesis, and SAR of monobenzamidines and aminoisoquinolines as factor Xa inhibitors. Bioorg Med Chem Lett12:1657-61 (2002) Prothrombin
Name:Prothrombin
Type:Protein
Mol. Mass.:70029.57
Organism:Homo sapiens (Human)
Description:P00734
Residue:622
BDBM50114479
NameBDBM50114479
Synonyms:2'-Sulfamoyl-biphenyl-4-carboxylic acid [2-(3-carbamimidoyl-phenoxy)-phenyl]-amide | CHEMBL297835
TypeSmall organic molecule
Emp. Form.C26H22N4O4S
Mol. Mass.486.542
SMILESNC(=N)c1cccc(Oc2ccccc2NC(=O)c2ccc(cc2)-c2ccccc2S(N)(=O)=O)c1