Reaction Details
TargetCoagulation factor X
LigandBDBM50114480
Substrate/Competitorn/a
Meas. Tech.ChEBML_48983
IC50 4.4±n/a nM
Citation Zhang, PZuckett, JFWoolfrey, JTran, KHuang, BWong, PSinha, UPark, GReed, AMalinowski, JHollenbach, SScarborough, RMZhu, BY Design, synthesis, and SAR of monobenzamidines and aminoisoquinolines as factor Xa inhibitors. Bioorg Med Chem Lett12:1657-61 (2002) Coagulation factor X
Name:Coagulation factor X
Type:Enzyme
Mol. Mass.:54726.60
Organism:Homo sapiens (Human)
Description:n/a
Residue:488
BDBM50114480
NameBDBM50114480
Synonyms:5-Bromo-2-(3-carbamimidoyl-phenoxy)-N-(2'-sulfamoyl-biphenyl-4-yl)-benzamide | CHEMBL43008
TypeSmall organic molecule
Emp. Form.C26H21BrN4O4S
Mol. Mass.565.438
SMILESNC(=N)c1cccc(Oc2ccc(Br)cc2C(=O)Nc2ccc(cc2)-c2ccccc2S(N)(=O)=O)c1