Reaction Details
TargetCoagulation factor X
LigandBDBM50114485
Substrate/Competitorn/a
Meas. Tech.ChEBML_48983
IC50 34±n/a nM
Citation Zhang, PZuckett, JFWoolfrey, JTran, KHuang, BWong, PSinha, UPark, GReed, AMalinowski, JHollenbach, SScarborough, RMZhu, BY Design, synthesis, and SAR of monobenzamidines and aminoisoquinolines as factor Xa inhibitors. Bioorg Med Chem Lett12:1657-61 (2002) Coagulation factor X
Name:Coagulation factor X
Type:Enzyme
Mol. Mass.:54726.60
Organism:Homo sapiens (Human)
Description:n/a
Residue:488
BDBM50114485
NameBDBM50114485
Synonyms:CHEMBL46770 | [[2-(3-Carbamimidoyl-phenoxy)-ethyl]-(2'-sulfamoyl-biphenyl-4-carbonyl)-amino]-acetic acid
TypeSmall organic molecule
Emp. Form.C24H24N4O6S
Mol. Mass.496.536
SMILESNC(=N)c1cccc(OCCN(CC(O)=O)C(=O)c2ccc(cc2)-c2ccccc2S(N)(=O)=O)c1