Reaction Details
TargetCoagulation factor X
LigandBDBM50114487
Substrate/Competitorn/a
Meas. Tech.ChEMBL_48983 (CHEMBL663512)
IC50 1.9±n/a nM
Citation Zhang, PZuckett, JFWoolfrey, JTran, KHuang, BWong, PSinha, UPark, GReed, AMalinowski, JHollenbach, SScarborough, RMZhu, BY Design, synthesis, and SAR of monobenzamidines and aminoisoquinolines as factor Xa inhibitors. Bioorg Med Chem Lett12:1657-61 (2002) Coagulation factor X
Name:Coagulation factor X
Type:Enzyme
Mol. Mass.:54726.60
Organism:Homo sapiens (Human)
Description:n/a
Residue:488
BDBM50114487
NameBDBM50114487
Synonyms:2-(3-Carbamimidoyl-phenoxy)-5-nitro-N-(2'-sulfamoyl-biphenyl-4-yl)-benzamide | CHEMBL45127
TypeSmall organic molecule
Emp. Form.C26H21N5O6S
Mol. Mass.531.54
SMILESNC(=N)c1cccc(Oc2ccc(cc2C(=O)Nc2ccc(cc2)-c2ccccc2S(N)(=O)=O)[N+]([O-])=O)c1