Reaction Details
TargetCoagulation factor X
LigandBDBM50114496
Substrate/Competitorn/a
Meas. Tech.ChEBML_48983
IC50 4.8±n/a nM
Citation Zhang, PZuckett, JFWoolfrey, JTran, KHuang, BWong, PSinha, UPark, GReed, AMalinowski, JHollenbach, SScarborough, RMZhu, BY Design, synthesis, and SAR of monobenzamidines and aminoisoquinolines as factor Xa inhibitors. Bioorg Med Chem Lett12:1657-61 (2002) Coagulation factor X
Name:Coagulation factor X
Type:Enzyme
Mol. Mass.:54726.60
Organism:Homo sapiens (Human)
Description:n/a
Residue:488
BDBM50114496
NameBDBM50114496
Synonyms:2-(3-Carbamimidoyl-phenoxy)-4-nitro-N-(2'-sulfamoyl-biphenyl-4-yl)-benzamide | CHEMBL417349
TypeSmall organic molecule
Emp. Form.C26H21N5O6S
Mol. Mass.531.54
SMILESNC(=N)c1cccc(Oc2cc(ccc2C(=O)Nc2ccc(cc2)-c2ccccc2S(N)(=O)=O)[N+]([O-])=O)c1