Reaction Details
TargetCoagulation factor X
LigandBDBM50114497
Substrate/Competitorn/a
Meas. Tech.ChEBML_48983
IC50 7.7±n/a nM
Citation Zhang, PZuckett, JFWoolfrey, JTran, KHuang, BWong, PSinha, UPark, GReed, AMalinowski, JHollenbach, SScarborough, RMZhu, BY Design, synthesis, and SAR of monobenzamidines and aminoisoquinolines as factor Xa inhibitors. Bioorg Med Chem Lett12:1657-61 (2002) Coagulation factor X
Name:Coagulation factor X
Type:Enzyme
Mol. Mass.:54726.60
Organism:Homo sapiens (Human)
Description:n/a
Residue:488
BDBM50114497
NameBDBM50114497
Synonyms:5-Acetylamino-2-(3-carbamimidoyl-phenoxy)-N-(2'-sulfamoyl-biphenyl-4-yl)-benzamide | CHEMBL295906
TypeSmall organic molecule
Emp. Form.C28H25N5O5S
Mol. Mass.543.594
SMILESCC(=O)Nc1ccc(Oc2cccc(c2)C(N)=N)c(c1)C(=O)Nc1ccc(cc1)-c1ccccc1S(N)(=O)=O