Reaction Details
TargetCoagulation factor X
LigandBDBM50114495
Substrate/Competitorn/a
Meas. Tech.ChEBML_48983
IC50 1810±n/a nM
Citation Zhang, PZuckett, JFWoolfrey, JTran, KHuang, BWong, PSinha, UPark, GReed, AMalinowski, JHollenbach, SScarborough, RMZhu, BY Design, synthesis, and SAR of monobenzamidines and aminoisoquinolines as factor Xa inhibitors. Bioorg Med Chem Lett12:1657-61 (2002) Coagulation factor X
Name:Coagulation factor X
Type:Enzyme
Mol. Mass.:54726.60
Organism:Homo sapiens (Human)
Description:n/a
Residue:488
BDBM50114495
NameBDBM50114495
Synonyms:2'-Sulfamoyl-biphenyl-4-carboxylic acid [2-(1-amino-isoquinolin-7-yloxy)-5-trifluoromethyl-phenyl]-amide | CHEMBL46938
TypeSmall organic molecule
Emp. Form.C29H21F3N4O4S
Mol. Mass.578.562
SMILESNc1nccc2ccc(Oc3ccc(cc3NC(=O)c3ccc(cc3)-c3ccccc3S(N)(=O)=O)C(F)(F)F)cc12