Reaction Details
TargetCoagulation factor X
LigandBDBM50085406
Substrate/Competitorn/a
Meas. Tech.ChEBML_49304
Ki 5.3±n/a nM
Citation Czekaj, MKlein, SIGuertin, KRGardner, CJZulli, ALPauls, HWSpada, APCheney, DLBrown, KDColussi, DJChu, VLeadley, RJDunwiddie, CT Optimization of the beta-aminoester class of factor Xa inhibitors. Part 1: P(4) and side-chain modifications for improved in vitro potency. Bioorg Med Chem Lett12:1667-70 (2002) Coagulation factor X
Name:Coagulation factor X
Type:Enzyme
Mol. Mass.:54726.60
Organism:Homo sapiens (Human)
Description:n/a
Residue:488
BDBM50085406
NameBDBM50085406
Synonyms:(2R,3R)-3-[(Biphenyl-4-carbonyl)-amino]-2-(3-carbamimidoyl-benzyl)-butyric acid methyl ester | CHEMBL45000
TypeSmall organic molecule
Emp. Form.C26H27N3O3
Mol. Mass.429.5109
SMILESCOC(=O)[C@H](Cc1cccc(c1)C(N)=N)[C@@H](C)NC(=O)c1ccc(cc1)-c1ccccc1