Reaction Details
TargetCoagulation factor X
LigandBDBM50114541
Substrate/Competitorn/a
Meas. Tech.ChEBML_49305
Ki 6±n/a nM
Citation Guertin, KRGardner, CJKlein, SIZulli, ALCzekaj, MGong, YSpada, APCheney, DLMaignan, SGuilloteau, JPBrown, KDColussi, DJChu, VHeran, CLMorgan, SRBentley, RGDunwiddie, CTLeadley, RJPauls, HW Optimization of the beta-aminoester class of factor Xa inhibitors. Part 2: Identification of FXV673 as a potent and selective inhibitor with excellent In vivo anticoagulant activity. Bioorg Med Chem Lett12:1671-4 (2002) Coagulation factor X
Name:Coagulation factor X
Type:Enzyme
Mol. Mass.:54726.60
Organism:Homo sapiens (Human)
Description:n/a
Residue:488
BDBM50114541
NameBDBM50114541
Synonyms:(2R,3R)-2-(3-Carbamimidoyl-benzyl)-3-(4-imidazol-1-yl-benzoylamino)-butyric acid methyl ester | CHEMBL45307
TypeSmall organic molecule
Emp. Form.C23H25N5O3
Mol. Mass.419.4763
SMILESCOC(=O)[C@H](Cc1cccc(c1)C(N)=N)[C@@H](C)NC(=O)c1ccc(cc1)-n1ccnc1