Reaction Details
TargetTyrosine-protein kinase Fyn
LigandBDBM50114585
Substrate/Competitorn/a
Meas. Tech.ChEBML_221302
IC50 59.0±n/a nM
Citation Calderwood, DJJohnston, DNMunschauer, RRafferty, P Pyrrolo[2,3-d]pyrimidines containing diverse N-7 substituents as potent inhibitors of Lck. Bioorg Med Chem Lett12:1683-6 (2002) Tyrosine-protein kinase Fyn
Name:Tyrosine-protein kinase Fyn
Type:Enzyme
Mol. Mass.:60762.21
Organism:Homo sapiens (Human)
Description:P06241
Residue:537
BDBM50114585
NameBDBM50114585
Synonyms:(R)-7-[4-(4-Methyl-piperazin-1-yl)-cyclohexyl]-5-(4-phenoxy-phenyl)-7H-pyrrolo[2,3-d]pyrimidin-4-ylamine | CHEMBL47203
TypeSmall organic molecule
Emp. Form.C29H34N6O
Mol. Mass.482.6199
SMILESCN1CCN(CC1)[C@H]1CC[C@H](CC1)n1cc(-c2ccc(Oc3ccccc3)cc2)c2c(N)ncnc12