Reaction Details
TargetMelatonin receptor type 1A
LigandBDBM50114707
Substrate/Competitorn/a
Meas. Tech.ChEMBL_105099 (CHEMBL714106)
Ki 3.51±n/a nM
Citation Wallez, VDurieux-Poissonnier, SChavatte, PBoutin, JAAudinot, VNicolas, JPBennejean, CDelagrange, PRenard, PLesieur, D Synthesis and structure-affinity-activity relationships of novel benzofuran derivatives as MT(2) melatonin receptor selective ligands. J Med Chem45:2788-800 (2002) Melatonin receptor type 1A
Name:Melatonin receptor type 1A
Type:Enzyme
Mol. Mass.:39392.94
Organism:Homo sapiens (Human)
Description:P48039
Residue:350
BDBM50114707
NameBDBM50114707
Synonyms:But-3-enoic acid [2-(2-benzyl-5-methoxy-benzofuran-3-yl)-ethyl]-amide | CHEMBL97186
TypeSmall organic molecule
Emp. Form.C22H23NO3
Mol. Mass.349.4229
SMILESCOc1ccc2oc(Cc3ccccc3)c(CCNC(=O)CC=C)c2c1