Reaction Details
TargetMelatonin receptor type 1B
LigandBDBM50114704
Substrate/Competitorn/a
Meas. Tech.ChEMBL_105263 (CHEMBL715855)
Ki 0.32±n/a nM
Citation Wallez, VDurieux-Poissonnier, SChavatte, PBoutin, JAAudinot, VNicolas, JPBennejean, CDelagrange, PRenard, PLesieur, D Synthesis and structure-affinity-activity relationships of novel benzofuran derivatives as MT(2) melatonin receptor selective ligands. J Med Chem45:2788-800 (2002) Melatonin receptor type 1B
Name:Melatonin receptor type 1B
Type:Enzyme
Mol. Mass.:40203.54
Organism:Homo sapiens (Human)
Description:P49286
Residue:362
BDBM50114704
NameBDBM50114704
Synonyms:CHEMBL33549 N-{2-[5-Methoxy-2-(3-methoxy-benzyl)-benzofuran-3-yl]-ethyl}-acetamide
TypeSmall organic molecule
Emp. Form.C21H23NO4
Mol. Mass.353.4116
SMILESCOc1cccc(Cc2oc3ccc(OC)cc3c2CCNC(C)=O)c1