Reaction Details
TargetMelatonin receptor type 1A
LigandBDBM50114725
Substrate/Competitorn/a
Meas. Tech.ChEMBL_105099 (CHEMBL714106)
Ki 0.02±n/a nM
Citation Wallez, VDurieux-Poissonnier, SChavatte, PBoutin, JAAudinot, VNicolas, JPBennejean, CDelagrange, PRenard, PLesieur, D Synthesis and structure-affinity-activity relationships of novel benzofuran derivatives as MT(2) melatonin receptor selective ligands. J Med Chem45:2788-800 (2002) Melatonin receptor type 1A
Name:Melatonin receptor type 1A
Type:Enzyme
Mol. Mass.:39392.94
Organism:Homo sapiens (Human)
Description:P48039
Residue:350
BDBM50114725
NameBDBM50114725
Synonyms:CHEMBL314512 | N-[2-(5-Methoxy-2-phenyl-benzofuran-3-yl)-ethyl]-acrylamide
TypeSmall organic molecule
Emp. Form.C20H19NO3
Mol. Mass.321.3698
SMILESCOc1ccc2oc(c(CCNC(=O)C=C)c2c1)-c1ccccc1