Reaction Details
TargetMelatonin receptor type 1B
LigandBDBM50037242
Substrate/Competitorn/a
Meas. Tech.ChEMBL_105263 (CHEMBL715855)
Ki 0.34±n/a nM
Citation Wallez, VDurieux-Poissonnier, SChavatte, PBoutin, JAAudinot, VNicolas, JPBennejean, CDelagrange, PRenard, PLesieur, D Synthesis and structure-affinity-activity relationships of novel benzofuran derivatives as MT(2) melatonin receptor selective ligands. J Med Chem45:2788-800 (2002) Melatonin receptor type 1B
Name:Melatonin receptor type 1B
Type:Enzyme
Mol. Mass.:40203.54
Organism:Homo sapiens (Human)
Description:P49286
Residue:362
BDBM50037242
NameBDBM50037242
Synonyms:CHEMBL323332 N-[2-(5-Methoxy-benzofuran-3-yl)-ethyl]-acetamide
TypeSmall organic molecule
Emp. Form.C13H15NO3
Mol. Mass.233.2631
SMILESCOc1ccc2occ(CCNC(C)=O)c2c1