Reaction Details
TargetNeuronal acetylcholine receptor subunit alpha-4/beta-2
LigandBDBM50114761
Substrate/Competitorn/a
Meas. Tech.ChEMBL_143415 (CHEMBL750057)
Ki 2.6±n/a nM
Citation Zhang, NTomizawa, MCasida, JE Structural features of azidopyridinyl neonicotinoid probes conferring high affinity and selectivity for mammalian alpha4beta2 and Drosophila nicotinic receptors. J Med Chem45:2832-40 (2002) Neuronal acetylcholine receptor subunit alpha-4/beta-2
Name:Neuronal acetylcholine receptor subunit alpha-4/beta-2
Type:Protein
Mol. Mass.:n/a
Description:n/a
Components:This complex has 2 components.
Component 1
Name:Neuronal acetylcholine receptor subunit alpha-4
Synonyms:ACHA4_HUMAN CHRNA4 protein Neuronal acetylcholine receptor protein alpha-4 subunit Nicotinic acetylcholine receptor alpha4/beta2/alpha5
Type:n/a
Mol. Mass.:69963.49
Organism:Homo sapiens (Human)
Description:NACHRA4
Residue:627
Component 2
Name:Neuronal acetylcholine receptor subunit beta-2
Synonyms:ACHB2_HUMAN Neuronal acetylcholine receptor protein beta-2 subunit | Nicotinic acetylcholine receptor alpha3/beta2/alpha5
Type:Protein
Mol. Mass.:57020.50
Organism:Homo sapiens (Human)
Description:P17787
Residue:502
BDBM50114761
NameBDBM50114761
Synonyms:1-(5-Azido-6-chloro-pyridin-3-ylmethyl)-imidazolidin-2-ylideneamine | CHEMBL316493
TypeSmall organic molecule
Emp. Form.C9H10ClN7
Mol. Mass.251.676
SMILESNC1=NCCN1Cc1cnc(Cl)c(c1)N=[N+]=[N-]