Reaction Details
TargetHistone deacetylase 1
LigandBDBM50114823
Substrate/Competitorn/a
Meas. Tech.ChEMBL_87852 (CHEMBL701992)
IC50 8±n/a nM
Citation Woo, SHFrechette, SAbou Khalil, EBouchain, GVaisburg, ABernstein, NMoradei, OLeit, SAllan, MFournel, MTrachy-Bourget, MCLi, ZBesterman, JMDelorme, D Structurally simple trichostatin A-like straight chain hydroxamates as potent histone deacetylase inhibitors. J Med Chem45:2877-85 (2002) Histone deacetylase 1
Name:Histone deacetylase 1
Type:Enzyme
Mol. Mass.:55090.27
Organism:Homo sapiens (Human)
Description:Q13547
Residue:482
BDBM50114823
NameBDBM50114823
Synonyms:8-Naphthalen-2-yl-non-8-enoic acid hydroxyamide N-hydroxy-8-(naphthalen-2-yl)non-8-enamide
TypeSmall organic molecule
Emp. Form.C19H23NO2
Mol. Mass.297.3914
SMILESONC(=O)CCCCCCC(=C)c1ccc2ccccc2c1