Reaction Details
TargetHistone deacetylase 1
LigandBDBM50114830
Substrate/Competitorn/a
Meas. Tech.ChEMBL_87852 (CHEMBL701992)
IC50 50±n/a nM
Citation Woo, SHFrechette, SAbou Khalil, EBouchain, GVaisburg, ABernstein, NMoradei, OLeit, SAllan, MFournel, MTrachy-Bourget, MCLi, ZBesterman, JMDelorme, D Structurally simple trichostatin A-like straight chain hydroxamates as potent histone deacetylase inhibitors. J Med Chem45:2877-85 (2002) Histone deacetylase 1
Name:Histone deacetylase 1
Type:Enzyme
Mol. Mass.:55090.27
Organism:Homo sapiens (Human)
Description:Q13547
Residue:482
BDBM50114830
NameBDBM50114830
Synonyms:8-Oxo-8-thiophen-2-yl-octanoic acid hydroxyamide | CHEMBL99394
TypeSmall organic molecule
Emp. Form.C12H17NO3S
Mol. Mass.255.333
SMILESONC(=O)CCCCCCC(=O)c1cccs1