Reaction Details
TargetPotassium voltage-gated channel subfamily H member 2
LigandBDBM50114958
Substrate/Competitorn/a
Meas. Tech.ChEBML_205711
Ki 1400±n/a nM
Citation Cooper, LCCarlson, EJCastro, JLChicchi, GGDinnell, KDi Salvo, JElliott, JMHollingworth, GJKurtz, MMRidgill, MPRycroft, WTsao, KLSwain, CJ 4,4-Disubstituted cyclohexylamine NK(1) receptor antagonists II. Bioorg Med Chem Lett12:1759-62 (2002) Potassium voltage-gated channel subfamily H member 2
Name:Potassium voltage-gated channel subfamily H member 2
Type:Multi-pass membrane protein
Mol. Mass.:126672.65
Organism:Homo sapiens (Human)
Description:Q12809
Residue:1159
BDBM50114958
NameBDBM50114958
Synonyms:2-(3,5-Bis-trifluoromethyl-phenyl)-N-[4-(4-hydroxy-piperidin-1-yl)-1-phenyl-cyclohexyl]-propionamide | CHEMBL298858
TypeSmall organic molecule
Emp. Form.C28H32F6N2O2
Mol. Mass.542.5563
SMILESCC(C(=O)N[C@]1(CC[C@@H](CC1)N1CCC(O)CC1)c1ccccc1)c1cc(cc(c1)C(F)(F)F)C(F)(F)F