Reaction Details
TargetSubstance-P receptor
LigandBDBM50114962
Substrate/Competitorn/a
Meas. Tech.ChEMBL_205711 (CHEMBL807958)
IC50 0.330000±n/a nM
Citation Cooper, LCCarlson, EJCastro, JLChicchi, GGDinnell, KDi Salvo, JElliott, JMHollingworth, GJKurtz, MMRidgill, MPRycroft, WTsao, KLSwain, CJ 4,4-Disubstituted cyclohexylamine NK(1) receptor antagonists II. Bioorg Med Chem Lett12:1759-62 (2002) Substance-P receptor
Name:Substance-P receptor
Type:G Protein-Coupled Receptor (GPCR)
Mol. Mass.:46254.43
Organism:Homo sapiens (Human)
Description:P25103
Residue:407
BDBM50114962
NameBDBM50114962
Synonyms:CHEMBL3085130 | N-[4-(4-Benzyl-4-hydroxy-piperidin-1-yl)-1-phenyl-cyclohexyl]-2-(3,5-bis-trifluoromethyl-phenyl)-propionamide
TypeSmall organic molecule
Emp. Form.C35H38F6N2O2
Mol. Mass.632.6788
SMILESCC(C(=O)NC1(CCC(CC1)N1CCC(O)(Cc2ccccc2)CC1)c1ccccc1)c1cc(cc(c1)C(F)(F)F)C(F)(F)F