Reaction Details
TargetMelanocyte-stimulating hormone receptor
LigandBDBM50115291
Substrate/Competitorn/a
Meas. Tech.ChEMBL_104587 (CHEMBL715332)
IC50 1.2±n/a nM
Citation Cheng, ZChen, JMiao, YOwen, NKQuinn, TPJurisson, SS Modification of the structure of a metallopeptide: synthesis and biological evaluation of (111)In-labeled DOTA-conjugated rhenium-cyclized alpha-MSH analogues. J Med Chem45:3048-56 (2002) Melanocyte-stimulating hormone receptor
Name:Melanocyte-stimulating hormone receptor
Type:PROTEIN
Mol. Mass.:35238.60
Organism:Mus musculus
Description:ChEMBL_1498846
Residue:315
BDBM50115291
NameBDBM50115291
Synonyms:CHEMBL269739 | DOTA-ReCCEHdFRWCKPV-NH2
TypeSmall organic molecule
Emp. Form.C75H107N23O21ReS3
Mol. Mass.1949.197
SMILESCC(C)C(NC(=O)C1CCCN1C(=O)C(CCCCN)NC(=O)C1NC(=O)C(Cc2c[nH]c3ccccc23)NC(=O)C(CCCNC(N)=N)NC(=O)[C@H](Cc2ccccc2)NC(=O)C(Cc2cnc[nH]2)NC(=O)C(CCC(O)=O)NC(=O)C2S[Re-]3([O-])(SC(NC(=O)CN4CCN(CC(O)=O)CCN(CC(O)=O)CCN(CC(O)=O)CC4)C(=O)N23)S1)C(N)=O