Reaction Details
TargetTransporter
LigandBDBM50115642
Substrate/Competitorn/a
Meas. Tech.ChEMBL_142632 (CHEMBL746900)
IC50 1240±n/a nM
Citation Wikström, HVMensonides-Harsema, MMCremers, TIMoltzen, EKArnt, J Synthesis and pharmacological testing of 1,2,3,4,10,14b-hexahydro-6-methoxy-2-methyldibenzo[c,f]pyrazino[1,2-a]azepin and its enantiomers in comparison with the two antidepressants mianserin and mirtazapine. J Med Chem45:3280-5 (2002) Transporter
Name:Transporter
Type:PROTEIN
Mol. Mass.:66787.87
Organism:Rattus norvegicus
Description:ChEMBL_1463061
Residue:597
BDBM50115642
NameBDBM50115642
Synonyms:(+)-65-Methoxy-2-methyl-1,2,3,4,9,13b-hexahydro-2,4a-diaza-tribenzo[a,c,e]cycloheptene | CHEMBL111184
TypeSmall organic molecule
Emp. Form.C19H22N2O
Mol. Mass.294.3908
SMILESCOc1cccc2Cc3ccccc3[C@H]3CN(C)CCN3c12