Reaction Details
TargetD(4) dopamine receptor
LigandBDBM50115642
Substrate/Competitorn/a
Meas. Tech.ChEMBL_60823 (CHEMBL675812)
Ki 160±n/a nM
Citation Wikström, HVMensonides-Harsema, MMCremers, TIMoltzen, EKArnt, J Synthesis and pharmacological testing of 1,2,3,4,10,14b-hexahydro-6-methoxy-2-methyldibenzo[c,f]pyrazino[1,2-a]azepin and its enantiomers in comparison with the two antidepressants mianserin and mirtazapine. J Med Chem45:3280-5 (2002) D(4) dopamine receptor
Name:D(4) dopamine receptor
Type:Enzyme
Mol. Mass.:48373.19
Organism:Homo sapiens (Human)
Description:P21917
Residue:419
BDBM50115642
NameBDBM50115642
Synonyms:(+)-65-Methoxy-2-methyl-1,2,3,4,9,13b-hexahydro-2,4a-diaza-tribenzo[a,c,e]cycloheptene | CHEMBL111184
TypeSmall organic molecule
Emp. Form.C19H22N2O
Mol. Mass.294.3908
SMILESCOc1cccc2Cc3ccccc3[C@H]3CN(C)CCN3c12